BDBM50169856 5,6-Dimethoxy-2-{3-[1-(4-methyl-piperazin-1-yl)-ethyl]-phenoxy}-indan-1-one::CHEMBL181207
SMILES COc1cc2CC(Oc3cccc(c3)C(C)N3CCN(C)CC3)C(=O)c2cc1OC
InChI Key InChIKey=WIQVBHOBPDSBBG-UHFFFAOYSA-N
Data  1 KI  3 IC50
  Tab Delimited (TSV)   2D SDfile   Computed 3D by Vconf -m prep SDfile
Find this compound or compounds like it in BindingDB:
Activity Spreadsheet -- Enzyme Inhibition Constant Data from BindingDB
Found 4 hits for monomerid = 50169856
TargetAcetylcholinesterase(Homo sapiens (Human))TBA
LigandPNGBDBM50169856(5,6-Dimethoxy-2-{3-[1-(4-methyl-piperazin-1-yl)-et...)
Affinity DataKi:  78nM. Assay description: Binding affinity to acetylcholinesterase (unknown origin)
In DepthDetails Article
TargetAcetylcholinesterase(Rattus norvegicus (rat))TBA
LigandPNGBDBM50169856(5,6-Dimethoxy-2-{3-[1-(4-methyl-piperazin-1-yl)-et...)
Affinity DataIC50:  1.76E+4nM. Assay description: Inhibition of acetylcholinesterase in Rattus norvegicus (rat) cortex by Ellman method
In DepthDetails Article
TargetCarboxylic ester hydrolase(Rattus norvegicus (rat))
Zhejiang University
Curated by ChEMBL
LigandPNGBDBM50169856(5,6-Dimethoxy-2-{3-[1-(4-methyl-piperazin-1-yl)-et...)
Affinity DataIC50:  2.52E+5nM. Assay description: In vitro inhibitory concentration against butyrylcholinesterase was determined using rat serum homogenate
In DepthDetails ArticlePubMed
TargetAcetylcholinesterase(Rattus norvegicus (rat))TBA
LigandPNGBDBM50169856(5,6-Dimethoxy-2-{3-[1-(4-methyl-piperazin-1-yl)-et...)
Affinity DataIC50:  1.76E+4nM. Assay description: In vitro inhibitory concentration against rat cortex acetylcholinesterase
In DepthDetails ArticlePubMed