BDBM50169862 5,6-Dimethoxy-2-[3-(4-methyl-piperazin-1-ylmethyl)-phenoxy]-indan-1-one::CHEMBL264242
SMILES COc1cc2CC(Oc3cccc(CN4CCN(C)CC4)c3)C(=O)c2cc1OC
InChI Key InChIKey=UNRGUOAZKUZHRW-UHFFFAOYSA-N
Data  1 KI  3 IC50
  Tab Delimited (TSV)   2D SDfile   Computed 3D by Vconf -m prep SDfile
Find this compound or compounds like it in BindingDB:
Activity Spreadsheet -- Enzyme Inhibition Constant Data from BindingDB
Found 4 hits for monomerid = 50169862
TargetAcetylcholinesterase(Homo sapiens (Human))TBA
LigandPNGBDBM50169862(5,6-Dimethoxy-2-[3-(4-methyl-piperazin-1-ylmethyl)...)
Affinity DataKi:  62nM. Assay description: Binding affinity to acetylcholinesterase (unknown origin)
In DepthDetails Article
TargetAcetylcholinesterase(Rattus norvegicus (rat))TBA
LigandPNGBDBM50169862(5,6-Dimethoxy-2-[3-(4-methyl-piperazin-1-ylmethyl)...)
Affinity DataIC50:  6.41E+3nM. Assay description: Inhibition of acetylcholinesterase in Rattus norvegicus (rat) cortex by Ellman method
In DepthDetails Article
TargetCarboxylic ester hydrolase(Rattus norvegicus (rat))
Zhejiang University
Curated by ChEMBL
LigandPNGBDBM50169862(5,6-Dimethoxy-2-[3-(4-methyl-piperazin-1-ylmethyl)...)
Affinity DataIC50:  2.09E+5nM. Assay description: In vitro inhibitory concentration against butyrylcholinesterase was determined using rat serum homogenate
In DepthDetails ArticlePubMed
TargetAcetylcholinesterase(Rattus norvegicus (rat))TBA
LigandPNGBDBM50169862(5,6-Dimethoxy-2-[3-(4-methyl-piperazin-1-ylmethyl)...)
Affinity DataIC50:  6.41E+3nM. Assay description: In vitro inhibitory concentration against rat cortex acetylcholinesterase
In DepthDetails ArticlePubMed