BDBM50169863 5,6-Dimethoxy-2-(4-piperidin-1-ylmethyl-phenoxy)-indan-1-one::CHEMBL180145
SMILES COc1cc2CC(Oc3ccc(CN4CCCCC4)cc3)C(=O)c2cc1OC
InChI Key InChIKey=XLQVMWUFCABLFZ-UHFFFAOYSA-N
Data  1 KI  3 IC50
  Tab Delimited (TSV)   2D SDfile   Computed 3D by Vconf -m prep SDfile
Find this compound or compounds like it in BindingDB:
Activity Spreadsheet -- Enzyme Inhibition Constant Data from BindingDB
Found 4 hits for monomerid = 50169863
TargetAcetylcholinesterase(Homo sapiens (Human))TBA
LigandPNGBDBM50169863(5,6-Dimethoxy-2-(4-piperidin-1-ylmethyl-phenoxy)-i...)
Affinity DataKi:  403nM. Assay description: Binding affinity to acetylcholinesterase (unknown origin)
In DepthDetails Article
TargetAcetylcholinesterase(Rattus norvegicus (rat))TBA
LigandPNGBDBM50169863(5,6-Dimethoxy-2-(4-piperidin-1-ylmethyl-phenoxy)-i...)
Affinity DataIC50:  150nM. Assay description: Inhibition of acetylcholinesterase in Rattus norvegicus (rat) cortex by Ellman method
In DepthDetails Article
TargetCarboxylic ester hydrolase(Rattus norvegicus (rat))
Zhejiang University
Curated by ChEMBL
LigandPNGBDBM50169863(5,6-Dimethoxy-2-(4-piperidin-1-ylmethyl-phenoxy)-i...)
Affinity DataIC50:  2.62E+5nM. Assay description: In vitro inhibitory concentration against butyrylcholinesterase was determined using rat serum homogenate
In DepthDetails ArticlePubMed
TargetAcetylcholinesterase(Rattus norvegicus (rat))TBA
LigandPNGBDBM50169863(5,6-Dimethoxy-2-(4-piperidin-1-ylmethyl-phenoxy)-i...)
Affinity DataIC50:  150nM. Assay description: In vitro inhibitory concentration against rat cortex acetylcholinesterase
In DepthDetails ArticlePubMed