BDBM50170971 CHEMBL3805235
SMILES Cc1ccnc2c3CN(Cc3nn12)[C@@H]1CO[C@@H]([C@@H](N)C1)c1cc(F)c(F)cc1F
InChI Key InChIKey=WHCJCQWHYSCOHH-WOVYWWTOSA-N
Data  3 IC50
  Tab Delimited (TSV)   2D SDfile   Computed 3D by Vconf -m prep SDfile
Find this compound or compounds like it in BindingDB:
Activity Spreadsheet -- Enzyme Inhibition Constant Data from BindingDB
Found 3 hits for monomerid = 50170971
TargetDipeptidyl peptidase 4(Homo sapiens (Human))
Merck Research Laboratories
Curated by ChEMBL
LigandPNGBDBM50170971(CHEMBL3805235)
Affinity DataIC50:  44nM. Assay description: Inhibition of human DPP4
In DepthDetails ArticlePubMed
TargetDipeptidyl peptidase 8(Homo sapiens (Human))
Merck Research Laboratories
Curated by ChEMBL
LigandPNGBDBM50170971(CHEMBL3805235)
Affinity DataIC50:  1.00E+5nM. Assay description: Inhibition of DPP8 (unknown origin)
In DepthDetails ArticlePubMed
TargetAcyl-protein thioesterase 1(Rattus norvegicus)
Merck Research Laboratories
Curated by ChEMBL
LigandPNGBDBM50170971(CHEMBL3805235)
Affinity DataIC50:  9.10E+4nM. Assay description: Inhibition of human FAP
In DepthDetails ArticlePubMed