BDBM50171179 (2S,4aR,6aR,7R,9S,10aS,10bR)-9-acetoxy-2-(furan-3-yl)-6a,10b-dimethyl-4,10-dioxo-dodecahydro-1H-benzo[f]isochromene-7-carboxylic acid::(3S,4aR,4bS,6S,8R,8aR,10aR)-6-Acetoxy-3-furan-3-yl-4a,8a-dimethyl-1,5-dioxo-dodecahydro-2-oxa-phenanthrene-8-carboxylic acid::CHEMBL193690
SMILES CC(=O)O[C@H]1C[C@@H](C(O)=O)[C@]2(C)CC[C@H]3C(=O)O[C@@H](C[C@]3(C)[C@H]2C1=O)c1ccoc1
InChI Key InChIKey=JFOYNIOEQMKAOX-VOVNARLJSA-N
Data  2 KI
  Tab Delimited (TSV)   2D SDfile   Computed 3D by Vconf -m prep SDfile
Find this compound or compounds like it in BindingDB:
Activity Spreadsheet -- Enzyme Inhibition Constant Data from BindingDB
Found 2 hits for monomerid = 50171179
TargetKappa-type opioid receptor(Homo sapiens (Human))
Harvard Medical School
Curated by ChEMBL
LigandPNGBDBM50171179((2S,4aR,6aR,7R,9S,10aS,10bR)-9-acetoxy-2-(furan-3-...)
Affinity DataKi: >1.00E+3nM. Assay description: Displacement of [3H]diprenorphine binding from human kappa opioid receptor expressed in CHO cells
In DepthDetails ArticlePubMed
TargetKappa-type opioid receptor(Homo sapiens (Human))
Harvard Medical School
Curated by ChEMBL
LigandPNGBDBM50171179((2S,4aR,6aR,7R,9S,10aS,10bR)-9-acetoxy-2-(furan-3-...)
Affinity DataKi: >1.00E+3nM. Assay description: Binding affinity for 1 uM [3H]-diprenorphine against human Opioid receptor kappa expressed in chinese hamster ovary cells (CHO cells)
In DepthDetails ArticlePubMed