BDBM50171403 CHEMBL3805704
SMILES CNC(=O)c1cccc(OCCCCN2CCN(CC2)c2cccc3sccc23)c1
InChI Key InChIKey=RYXYJLZLSOOSMR-UHFFFAOYSA-N
Data  2 IC50  1 EC50
  Tab Delimited (TSV)   2D SDfile   Computed 3D by Vconf -m prep SDfile
Find this compound or compounds like it in BindingDB:
Activity Spreadsheet -- Enzyme Inhibition Constant Data from BindingDB
Found 3 hits for monomerid = 50171403
TargetD(2) dopamine receptor(Homo sapiens (Human))
Shanghai Institute Of Materia Medica
Curated by ChEMBL
LigandPNGBDBM50171403(CHEMBL3805704)
Affinity DataIC50:  91nM. Assay description: Antagonistic activity at human dopamine D2 receptor measured after 60 mins by Ultra Lance cAMP assay
In DepthDetails ArticlePubMed
Target5-hydroxytryptamine receptor 2A(Homo sapiens (Human))
Shanghai Institute Of Materia Medica
Curated by ChEMBL
LigandPNGBDBM50171403(CHEMBL3805704)
Affinity DataIC50:  216nM. Assay description: Antagonistic activity at human 5-HT2A receptor assessed as calcium flux after 10 mins by FLIPR assay
In DepthDetails ArticlePubMed
Target5-hydroxytryptamine receptor 1A(Homo sapiens (Human))
Shanghai Institute Of Materia Medica
Curated by ChEMBL
LigandPNGBDBM50171403(CHEMBL3805704)
Affinity DataEC50:  5.10nM. Assay description: Agonistic activity at human 5-HT1A receptor measured after 60 mins by Ultra Lance cAMP assay
In DepthDetails ArticlePubMed