BDBM50171548 (S)-2-(S)-Amino-1-(2-boron-dihydroxide-pyrrolidin-1-yl)-hexan-1-one::CHEMBL194852
SMILES CCCC[C@H](N)C(=O)N1CCC[C@@H]1B(O)O
InChI Key InChIKey=KYIRAKNWGLQGKF-DTWKUNHWSA-N
Data  5 IC50
  Tab Delimited (TSV)   2D SDfile   Computed 3D by Vconf -m prep SDfile
Find this compound or compounds like it in BindingDB:
Activity Spreadsheet -- Enzyme Inhibition Constant Data from BindingDB
Found 5 hits for monomerid = 50171548
TargetProlyl endopeptidase FAP(Homo sapiens (Human))
Activx Biosciences
Curated by ChEMBL
LigandPNGBDBM50171548((S)-2-(S)-Amino-1-(2-boron-dihydroxide-pyrrolidin-...)
Affinity DataIC50:  4.10E+3nM. Assay description: Inhibitory concentration against human fibroblast activation protein alpha
In DepthDetails ArticlePubMed
TargetDipeptidyl peptidase 8(Homo sapiens (Human))
Activx Biosciences
Curated by ChEMBL
LigandPNGBDBM50171548((S)-2-(S)-Amino-1-(2-boron-dihydroxide-pyrrolidin-...)
Affinity DataIC50:  30nM. Assay description: Inhibitory concentration against human dipeptidylpeptidase 8 using FP-TAMRA incubated for 30 min
In DepthDetails ArticlePubMed
TargetDipeptidyl peptidase 2(Homo sapiens (Human))
Activx Biosciences
Curated by ChEMBL
LigandPNGBDBM50171548((S)-2-(S)-Amino-1-(2-boron-dihydroxide-pyrrolidin-...)
Affinity DataIC50:  2nM. Assay description: Inhibitory concentration against human dipeptidylpeptidase 7
In DepthDetails ArticlePubMed
TargetDipeptidyl peptidase 9(Homo sapiens (Human))
Activx Biosciences
Curated by ChEMBL
LigandPNGBDBM50171548((S)-2-(S)-Amino-1-(2-boron-dihydroxide-pyrrolidin-...)
Affinity DataIC50:  4.60nM. Assay description: Inhibitory concentration against human dipeptidylpeptidase 9 using FP-TAMRA incubated for 30 min
In DepthDetails ArticlePubMed
TargetDipeptidyl peptidase 4(Homo sapiens (Human))
Activx Biosciences
Curated by ChEMBL
LigandPNGBDBM50171548((S)-2-(S)-Amino-1-(2-boron-dihydroxide-pyrrolidin-...)
Affinity DataIC50:  4.5nM. Assay description: Inhibitory concentration against human dipeptidylpeptidase 4
In DepthDetails ArticlePubMed