BDBM501721 2-Methyl-4-((1-methylpiperidin-4-yl)methoxy)-6-phenoxy-9H-xanthen-9-one::US11028064, Example 35
SMILES Cc1cc(OCC2CCN(CC2)C(=O)OC(C)(C)C)c2oc3cc(Oc4ccccc4)ccc3c(=O)c2c1
InChI Key InChIKey=KAXXWPDGSPIIHJ-UHFFFAOYSA-N
Data  1 IC50
  Tab Delimited (TSV)   2D SDfile   Computed 3D by Vconf -m prep SDfile
Find this compound or compounds like it in BindingDB:
Activity Spreadsheet -- Enzyme Inhibition Constant Data from BindingDB
Found 1 hit for monomerid = 501721
TargetMacrophage colony-stimulating factor 1 receptor(Homo sapiens (Human))
Auckland Uniservices
US Patent
LigandPNGBDBM501721(2-Methyl-4-((1-methylpiperidin-4-yl)methoxy)-6-phe...)
Affinity DataIC50:  550nM. Assay description: IC50 values were determined using the Z′-LYTEŽ activity assay, with ATP concentration used at Km app for the specific assay (500 μM ATP fo...
Ligand InfoPC cidPC sid
In DepthDetails US Patent