BDBM50172350 CHEMBL3810142
SMILES Clc1ccc2ccc(\C=C\c3cccc(COC(=O)\C=C\c4c[nH]c5cc(Cl)cc(Cl)c45)c3)nc2c1
InChI Key InChIKey=HFXNFYJSMCRIAG-BFFNUNQPSA-N
Data  2 IC50
  Tab Delimited (TSV)   2D SDfile   Computed 3D by Vconf -m prep SDfile
Find this compound or compounds like it in BindingDB:
Activity Spreadsheet -- Enzyme Inhibition Constant Data from BindingDB
Found 2 hits for monomerid = 50172350
TargetCysteinyl leukotriene receptor 2(Homo sapiens (Human))
Shanghai Institute Of Materia Medica
Curated by ChEMBL
LigandPNGBDBM50172350(CHEMBL3810142)
Affinity DataIC50: >1.00E+5nM. Assay description: Antagonist activity against CysLT2 receptor (unknown origin) expressed in HEK293 cells assessed as inhibition of LTD4-induced calcium mobilization pr...
In DepthDetails ArticlePubMed
TargetCysteinyl leukotriene receptor 1(Homo sapiens (Human))
Shanghai Institute Of Materia Medica
Curated by ChEMBL
LigandPNGBDBM50172350(CHEMBL3810142)
Affinity DataIC50:  3.10E+4nM. Assay description: Antagonist activity against CysLT1 receptor (unknown origin) expressed in HEK293 cells assessed as inhibition of LTD4-induced calcium mobilization pr...
In DepthDetails ArticlePubMed