BDBM50172385 CHEMBL3809972
SMILES CSCCC(NC(=O)C(CS)NC(=O)C(CCCNC(N)=N)NC(=O)C(CCCNC(N)=N)NC(=O)C1CCC(=O)N1)C(=O)N1CCCC1C(=O)NC(CC(C)C)C(=O)NC(Cc1cnc[nH]1)C(=O)NC(CO)C(=O)NC(C)C(=O)NC(C(C)C)C(=O)N1CCCC1C(=O)NC(Cc1ccccc1)C(=O)N1CCCC1C(O)=O
InChI Key InChIKey=GAICDMQRJWUXLP-JWUSKFGYSA-N
Data  1 KI  2 EC50
  Tab Delimited (TSV)   2D SDfile   Computed 3D by Vconf -m prep SDfile
Find this compound or compounds like it in BindingDB:
Activity Spreadsheet -- Enzyme Inhibition Constant Data from BindingDB
Found 3 hits for monomerid = 50172385
TargetApelin receptor(Homo sapiens (Human))
Universit£
Curated by ChEMBL
LigandPNGBDBM50172385(CHEMBL3809972)
Affinity DataKi:  164nM. Assay description: Displacement of [125I]-Apelin-13[Glp65, Nle75, Tyr77] from YFP epitope-tagged human APJ expressed in HEK-293 cells after 1 hr by gamma counting metho...
In DepthDetails ArticlePubMed
TargetApelin receptor(Homo sapiens (Human))
Universit£
Curated by ChEMBL
LigandPNGBDBM50172385(CHEMBL3809972)
Affinity DataEC50: >1.00E+4nM. Assay description: Agonist activity at human APJ receptor expressed in HEK-293 cells assessed as beta-arrestin2 recruitment after 30 mins by BRET assay
In DepthDetails ArticlePubMed
TargetApelin receptor(Homo sapiens (Human))
Universit£
Curated by ChEMBL
LigandPNGBDBM50172385(CHEMBL3809972)
Affinity DataEC50:  147nM. Assay description: Agonist activity at human APJ receptor expressed in HEK-293 cells assessed as dissociation of G-alpha-i1 protein after 5 mins by BRET assay
In DepthDetails ArticlePubMed