BDBM50172743 CHEMBL438732::QEDIIRNIARHLAQVGDSMDRSIPPG
SMILES CC[C@H](C)[C@H](NC(=O)[C@H](CC(N)=O)NC(=O)[C@H](CCCN=C(N)N)NC(=O)[C@@H](NC(=O)[C@@H](NC(=O)[C@H](CC(O)=O)NC(=O)[C@H](CCC(O)=O)NC(=O)[C@@H](N)CCC(N)=O)[C@@H](C)CC)[C@@H](C)CC)C(=O)N[C@@H](C)C(=O)N[C@@H](CCCN=C(N)N)C(=O)N[C@@H](Cc1cnc[nH]1)C(=O)N[C@@H](CC(C)C)C(=O)N[C@@H](C)C(=O)N[C@@H](CCC(N)=O)C(=O)N[C@@H](C(C)C)C(=O)NCC(=O)N[C@@H](CC(O)=O)C(=O)N[C@@H](CO)C(=O)N[C@@H](CCSC)C(=O)N[C@@H](CC(O)=O)C(=O)N[C@@H](CCCN=C(N)N)C(=O)N[C@@H](CO)C(=O)N[C@@H]([C@@H](C)CC)C(=O)N1CCC[C@H]1C(=O)N1CCC[C@H]1C(=O)NCC(O)=O
InChI Key InChIKey=DBLAHBUXYZYVJU-KBTIYWAWSA-N
Data  1 IC50
  Tab Delimited (TSV)   2D SDfile   Computed 3D by Vconf -m prep SDfile
Find this compound or compounds like it in BindingDB:
Activity Spreadsheet -- Enzyme Inhibition Constant Data from BindingDB
Found 1 hit for monomerid = 50172743
TargetApoptosis regulator Bcl-2(Homo sapiens (Human))
University Of Illinois At Urbana-Champaign
Curated by ChEMBL
LigandPNGBDBM50172743(CHEMBL438732 | QEDIIRNIARHLAQVGDSMDRSIPPG)
Affinity DataIC50:  1.41E+4nM. Assay description: Inhibition of BCL2 by fluorescence polarization based competitive binding assay
In DepthDetails ArticlePubMed