BDBM501733 N-Cyclopentyl-3-(5-((6-(2-(dimethylamino)ethoxy)-9-oxo-9H-xanthen-3-yl)oxy)pyridine-2-yl)propanamide::US11028064, Example 47
SMILES CN(C)CCOc1ccc2c(c1)oc1cc(Oc3ccc(CCC(=O)NC4CCCC4)nc3)ccc1c2=O
InChI Key InChIKey=YIMHWSNKNXDRFK-UHFFFAOYSA-N
Data  1 IC50
  Tab Delimited (TSV)   2D SDfile   Computed 3D by Vconf -m prep SDfile
Find this compound or compounds like it in BindingDB:
Activity Spreadsheet -- Enzyme Inhibition Constant Data from BindingDB
Found 1 hit for monomerid = 501733
TargetMacrophage colony-stimulating factor 1 receptor(Homo sapiens (Human))
Auckland Uniservices
US Patent
LigandPNGBDBM501733(N-Cyclopentyl-3-(5-((6-(2-(dimethylamino)ethoxy)-9...)
Affinity DataIC50: <100nM. Assay description: IC50 values were determined using the Z′-LYTEŽ activity assay, with ATP concentration used at Km app for the specific assay (500 μM ATP fo...
Ligand InfoPC cidPC sid
In DepthDetails US Patent