BDBM50173709 3-((1S,2S)-2-Dimethylaminomethyl-cyclopropyl)-1H-indole-6-carbonitrile::CHEMBL197966
SMILES CN(C)C[C@H]1C[C@@H]1c1c[nH]c2cc(ccc12)C#N
InChI Key InChIKey=WFSQIXHBUDPSMK-YPMHNXCESA-N
Data  1 KI
  Tab Delimited (TSV)   2D SDfile   Computed 3D by Vconf -m prep SDfile
Find this compound or compounds like it in BindingDB:
Activity Spreadsheet -- Enzyme Inhibition Constant Data from BindingDB
Found 1 hit for monomerid = 50173709
TargetSodium-dependent serotonin transporter(Homo sapiens (Human))
Bristol-Myers Squibb Pharmaceutical Research Institute
Curated by ChEMBL
LigandPNGBDBM50173709(3-((1S,2S)-2-Dimethylaminomethyl-cyclopropyl)-1H-i...)
Affinity DataKi:  7.40nM. Assay description: Binding inhibition towards human serotonin transporter
In DepthDetails ArticlePubMed