BDBM50173711 (+)3-((1S,2R)-2-Dimethylaminomethyl-cyclopropyl)-1H-indole-5-carbonitrile::3-((1S,2R)-2-Dimethylaminomethyl-cyclopropyl)-1H-indole-5-carbonitrile::CHEMBL194910
SMILES CN(C)C[C@@H]1C[C@@H]1c1c[nH]c2ccc(cc12)C#N
InChI Key InChIKey=DEMWBYUAYXJYOC-RYUDHWBXSA-N
Data  1 KI
  Tab Delimited (TSV)   2D SDfile   Computed 3D by Vconf -m prep SDfile
Find this compound or compounds like it in BindingDB:
Activity Spreadsheet -- Enzyme Inhibition Constant Data from BindingDB
Found 1 hit for monomerid = 50173711
TargetSodium-dependent serotonin transporter(Homo sapiens (Human))
Bristol-Myers Squibb Pharmaceutical Research Institute
Curated by ChEMBL
LigandPNGBDBM50173711((+)3-((1S,2R)-2-Dimethylaminomethyl-cyclopropyl)-1...)
Affinity DataKi:  17nM. Assay description: Binding inhibition towards human serotonin transporter
In DepthDetails ArticlePubMed