BDBM50173864 1,1-Dioxo-2,3-dihydro-1H-1lambda*6*-benzo[b]thiophene-6-sulfonic acid amide::CHEMBL194528
SMILES NS(=O)(=O)c1ccc2CCS(=O)(=O)c2c1
InChI Key InChIKey=OTANTTWNYRHXMB-UHFFFAOYSA-N
Data  3 KI
  Tab Delimited (TSV)   2D SDfile   Computed 3D by Vconf -m prep SDfile
Find this compound or compounds like it in BindingDB:
Activity Spreadsheet -- Enzyme Inhibition Constant Data from BindingDB
Found 3 hits for monomerid = 50173864
TargetCarbonic anhydrase 2(Homo sapiens (Human))
Università
Curated by ChEMBL
LigandPNGBDBM50173864(1,1-Dioxo-2,3-dihydro-1H-1lambda*6*-benzo[b]thioph...)
Affinity DataKi:  8.80nM. Assay description: Inhibitory activity against human cloned Carbonic anhydrase II by the CO2 hydration method
In DepthDetails ArticlePubMed
TargetCarbonic anhydrase 9(Homo sapiens (Human))
Università
Curated by ChEMBL
LigandPNGBDBM50173864(1,1-Dioxo-2,3-dihydro-1H-1lambda*6*-benzo[b]thioph...)
Affinity DataKi:  10nM. Assay description: Inhibitory activity against catalytic domain of human cloned Carbonic anhydrase IX by the CO2 hydration method
In DepthDetails ArticlePubMed
TargetCarbonic anhydrase 1(Homo sapiens (Human))
Università
Curated by ChEMBL
LigandPNGBDBM50173864(1,1-Dioxo-2,3-dihydro-1H-1lambda*6*-benzo[b]thioph...)
Affinity DataKi:  72nM. Assay description: Inhibitory activity against human cloned Carbonic anhydrase I by the CO2 hydration method
In DepthDetails ArticlePubMed