BDBM501741 N-Cyclopentyl-3-(5-((5-(2-(diethylamino)ethoxy)-7-methyl-9-oxo-9H-xanthen-3-yl)oxy)pyridin-2-yl)propanamide::US11028064, Example 55
SMILES CCN(CC)CCOc1cc(C)cc2c1oc1cc(Oc3ccc(CCC(=O)NC4CCCC4)nc3)ccc1c2=O
InChI Key InChIKey=KPDPZRBHGXPVCC-UHFFFAOYSA-N
Data  2 IC50
  Tab Delimited (TSV)   2D SDfile   Computed 3D by Vconf -m prep SDfile
Find this compound or compounds like it in BindingDB:
Activity Spreadsheet -- Enzyme Inhibition Constant Data from BindingDB
Found 2 hits for monomerid = 501741
TargetVascular endothelial growth factor receptor 2(Homo sapiens (Human))
Auckland Uniservices
US Patent
LigandPNGBDBM501741(N-Cyclopentyl-3-(5-((5-(2-(diethylamino)ethoxy)-7-...)
Affinity DataIC50: >1.00E+4nM. Assay description: IC50 values were determined using the Z′-LYTEŽ activity assay, with ATP concentration used at Km app for the specific assay (500 μM ATP fo...
Ligand InfoPC cidPC sid
In DepthDetails US Patent
TargetMacrophage colony-stimulating factor 1 receptor(Homo sapiens (Human))
Auckland Uniservices
US Patent
LigandPNGBDBM501741(N-Cyclopentyl-3-(5-((5-(2-(diethylamino)ethoxy)-7-...)
Affinity DataIC50: <100nM. Assay description: IC50 values were determined using the Z′-LYTEŽ activity assay, with ATP concentration used at Km app for the specific assay (500 μM ATP fo...
Ligand InfoPC cidPC sid
In DepthDetails US Patent