BDBM501742 N-Cyclopentyl-3-[5-({7-methyl-5-[2-(4-morpholinyl)ethoxy]-9-oxo-9H-xanthen-3-yl}oxy)-2-pyridinyl]propanamide::US11028064, Example 56
SMILES Cc1cc(OCCN2CCOCC2)c2oc3cc(Oc4ccc(CCC(=O)NC5CCCC5)nc4)ccc3c(=O)c2c1
InChI Key InChIKey=FXZNLJFFZVRJLO-UHFFFAOYSA-N
Data  2 IC50
  Tab Delimited (TSV)   2D SDfile   Computed 3D by Vconf -m prep SDfile
Find this compound or compounds like it in BindingDB:
Activity Spreadsheet -- Enzyme Inhibition Constant Data from BindingDB
Found 2 hits for monomerid = 501742
TargetVascular endothelial growth factor receptor 2(Homo sapiens (Human))
Auckland Uniservices
US Patent
LigandPNGBDBM501742(N-Cyclopentyl-3-[5-({7-methyl-5-[2-(4-morpholinyl)...)
Affinity DataIC50: >1.00E+4nM. Assay description: IC50 values were determined using the Z′-LYTEŽ activity assay, with ATP concentration used at Km app for the specific assay (500 μM ATP fo...
Ligand InfoPC cidPC sid
In DepthDetails US Patent
TargetMacrophage colony-stimulating factor 1 receptor(Homo sapiens (Human))
Auckland Uniservices
US Patent
LigandPNGBDBM501742(N-Cyclopentyl-3-[5-({7-methyl-5-[2-(4-morpholinyl)...)
Affinity DataIC50: <100nM. Assay description: IC50 values were determined using the Z′-LYTEŽ activity assay, with ATP concentration used at Km app for the specific assay (500 μM ATP fo...
Ligand InfoPC cidPC sid
In DepthDetails US Patent