BDBM50174361 CHEMBL370606::L-888607::[(S)-9-(4-Chloro-phenylsulfanyl)-6-fluoro-2,3-dihydro-1H-pyrrolo[1,2-a]indol-1-yl]-acetic acid
SMILES OC(=O)C[C@@H]1CCn2c1c(Sc1ccc(Cl)cc1)c1ccc(F)cc21
InChI Key InChIKey=GSBAVONRPNJJOH-NSHDSACASA-N
Data  2 KI
  Tab Delimited (TSV)   2D SDfile   Computed 3D by Vconf -m prep SDfile
Find this compound or compounds like it in BindingDB:
Activity Spreadsheet -- Enzyme Inhibition Constant Data from BindingDB
Found 2 hits for monomerid = 50174361
TargetProstaglandin D2 receptor 2(Homo sapiens (Human))
Oxagen
Curated by ChEMBL
LigandPNGBDBM50174361(CHEMBL370606 | L-888607 | [(S)-9-(4-Chloro-phenyls...)
Affinity DataKi:  0.800nM. Assay description: Binding affinity towards human CRTH2 receptor expressed in CHO cells
In DepthDetails ArticlePubMed
TargetThromboxane A2 receptor(Homo sapiens (Human))
Merck Frosst Canada
Curated by ChEMBL
LigandPNGBDBM50174361(CHEMBL370606 | L-888607 | [(S)-9-(4-Chloro-phenyls...)
Affinity DataKi:  17nM. Assay description: Binding affinity to human recombinant TP receptor by radioligand competition binding assay
In DepthDetails ArticlePubMed