BDBM50175012 1,3,6,7-tetrahydroxy-4-(3-methylbut-2-enyl)-2-(2-methylbut-3-en-2-yl)-9H-xanthen-9-one::2,3,6,8-tetrahydroxy-5-(3-methylbut-2-enyl)-7-(2-methylbut-3-en-2-yl)-9H-xanthen-9-one::CHEMBL370126::macluraxanthone B
SMILES [#6]\[#6](-[#6])=[#6]\[#6]-c1c(-[#8])c(c(-[#8])c2c1oc1cc(-[#8])c(-[#8])cc1c2=O)C([#6])([#6])[#6]=[#6]
InChI Key InChIKey=QFYDCUMYVXSZFJ-UHFFFAOYSA-N
Data  2 IC50
  Tab Delimited (TSV)   2D SDfile   Computed 3D by Vconf -m prep SDfile
Find this compound or compounds like it in BindingDB:
Activity Spreadsheet -- Enzyme Inhibition Constant Data from BindingDB
Found 2 hits for monomerid = 50175012
TargetSterol O-acyltransferase 2(Homo sapiens (Human))
National Research Laboratory Of Lipid Metabolism And Atherosclerosis
Curated by ChEMBL
LigandPNGBDBM50175012(1,3,6,7-tetrahydroxy-4-(3-methylbut-2-enyl)-2-(2-m...)
Affinity DataIC50:  1.12E+5nM. Assay description: Inhibition of human ACAT2 expressed in Hi5 cells
In DepthDetails ArticlePubMed
TargetSterol O-acyltransferase 1(Homo sapiens (Human))
National Research Laboratory Of Lipid Metabolism And Atherosclerosis
Curated by ChEMBL
LigandPNGBDBM50175012(1,3,6,7-tetrahydroxy-4-(3-methylbut-2-enyl)-2-(2-m...)
Affinity DataIC50:  9.60E+4nM. Assay description: Inhibition of human ACAT1 expressed in Hi5 cells
In DepthDetails ArticlePubMed