BDBM50175216 5-(2-(dimethylamino)ethylamino)-2-ethylbenzo[d]oxazole-4,7-dione::CHEMBL199359
SMILES CCc1nc2c(O)c(cc(O)c2o1)N=CCN(C)C
InChI Key InChIKey=ONROJJULTWFIGT-UHFFFAOYSA-N
Data  1 IC50
  Tab Delimited (TSV)   2D SDfile   Computed 3D by Vconf -m prep SDfile
Find this compound or compounds like it in BindingDB:
Activity Spreadsheet -- Enzyme Inhibition Constant Data from BindingDB
Found 1 hit for monomerid = 50175216
TargetM-phase inducer phosphatase 3(Homo sapiens (Human))
Institut Henri Beaufour
Curated by ChEMBL
LigandPNGBDBM50175216(5-(2-(dimethylamino)ethylamino)-2-ethylbenzo[d]oxa...)
Affinity DataIC50:  130nM. Assay description: Inhibitory activity against recombinant CDC25C
In DepthDetails ArticlePubMed