BDBM50175644 CHEMBL200044::methyl 3-(4-(furan-2-yl)phenyl)-8-aza-bicyclo[3.2.1]octane-2-carboxylate
SMILES COC(=O)C1C2CCC(CC1c1ccc(cc1)-c1ccco1)N2
InChI Key InChIKey=ADPKSMMVDLGXJF-UHFFFAOYSA-N
Data  3 KI
  Tab Delimited (TSV)   2D SDfile   Computed 3D by Vconf -m prep SDfile
Find this compound or compounds like it in BindingDB:
Activity Spreadsheet -- Enzyme Inhibition Constant Data from BindingDB
Found 3 hits for monomerid = 50175644
TargetSodium-dependent serotonin transporter(Rattus norvegicus (rat))
Yale University
Curated by ChEMBL
LigandPNGBDBM50175644(CHEMBL200044 | methyl 3-(4-(furan-2-yl)phenyl)-8-a...)
Affinity DataKi:  0.150nM. Assay description: Displacement of [3H]paroxetine from SERT in rat frontoparietal cerebral cortex
In DepthDetails ArticlePubMed
TargetSodium-dependent dopamine transporter(Rattus norvegicus (rat))
Yale University
Curated by ChEMBL
LigandPNGBDBM50175644(CHEMBL200044 | methyl 3-(4-(furan-2-yl)phenyl)-8-a...)
Affinity DataKi:  3.76nM. Assay description: Displacement of [3H]GBR-12935 from DAT in rat rat frontoparietal cerebral cortex
In DepthDetails ArticlePubMed
TargetTransporter(Rattus norvegicus)
Yale University
Curated by ChEMBL
LigandPNGBDBM50175644(CHEMBL200044 | methyl 3-(4-(furan-2-yl)phenyl)-8-a...)
Affinity DataKi:  12.7nM. Assay description: Displacement of [3H]nisoxetine from NET in rat caudate-putamen
In DepthDetails ArticlePubMed