BDBM50175652 CHEMBL200667::Dodecanoic acid (S)-1-{2-[(S)-3-({2-[2-carboxy-3-(4-hydroxy-phenyl)-propionylamino]-ethoxy}-hydroxy-phosphoryloxy)-2-tetradecanoylamino-propoxy]-ethyl}-octyl ester
SMILES CCCCCCCCCCCCCC(=O)N[C@@H](COCC[C@H](CCCCCCC)OC(=O)CCCCCCCCCCC)COP(O)(=O)OCCNC(=O)C(Cc1ccc(O)cc1)C(O)=O
InChI Key InChIKey=WWCJEETVWHRGBF-KGXZGBMCSA-N
Data  2 IC50
  Tab Delimited (TSV)   2D SDfile   Computed 3D by Vconf -m prep SDfile
Find this compound or compounds like it in BindingDB:
Activity Spreadsheet -- Enzyme Inhibition Constant Data from BindingDB
Found 2 hits for monomerid = 50175652
TargetToll-like receptor 4(Homo sapiens (Human))
Eisai Research Institute
Curated by ChEMBL
LigandPNGBDBM50175652(CHEMBL200667 | Dodecanoic acid (S)-1-{2-[(S)-3-({2...)
Affinity DataIC50:  80nM. Assay description: Antagonistic potency at human TLR4 expressed in HEK293 cells
In DepthDetails ArticlePubMed
TargetToll-like receptor 2(Homo sapiens (Human))
Eisai Research Institute
Curated by ChEMBL
LigandPNGBDBM50175652(CHEMBL200667 | Dodecanoic acid (S)-1-{2-[(S)-3-({2...)
Affinity DataIC50:  6.90E+3nM. Assay description: Antagonistic potency at TLR2 expressed in HEK293 cells
In DepthDetails ArticlePubMed