BDBM50175916 8-[(1S,2S)-2-(4-methoxy-phenyl)-cyclohexyl]-1-phenyl-1,3,8-triaza-spiro[4.5]decan-4-one::CHEMBL380611
SMILES COc1ccc(cc1)[C@@H]1CCCC[C@@H]1N1CCC2(CC1)N(CNC2=O)c1ccccc1
InChI Key InChIKey=YCQGSXHCEZEBGW-ZEQRLZLVSA-N
Data  2 EC50
  Tab Delimited (TSV)   2D SDfile   Computed 3D by Vconf -m prep SDfile
Find this compound or compounds like it in BindingDB:
Activity Spreadsheet -- Enzyme Inhibition Constant Data from BindingDB
Found 2 hits for monomerid = 50175916
TargetSodium- and chloride-dependent glycine transporter 1(Homo sapiens (Human))
F. Hoffmann-La Roche
Curated by ChEMBL
LigandPNGBDBM50175916(8-[(1S,2S)-2-(4-methoxy-phenyl)-cyclohexyl]-1-phen...)
Affinity DataEC50:  610nM. Assay description: Inhibition of [3H]glycine uptake in cells transfected with human GlyT1 cDNA
In DepthDetails ArticlePubMed
TargetSodium- and chloride-dependent glycine transporter 2(Homo sapiens (Human))
F. Hoffmann-La Roche
Curated by ChEMBL
LigandPNGBDBM50175916(8-[(1S,2S)-2-(4-methoxy-phenyl)-cyclohexyl]-1-phen...)
Affinity DataEC50:  2.40E+4nM. Assay description: Inhibition of [3H]glycine uptake in cells transfected with human GlyT2 cDNA
In DepthDetails ArticlePubMed