BDBM50175920 1-phenyl-8-((trans, rac)-2-phenyl-cyclohexyl)-1,3,8-triaza-spiro[4.5]decan-4-one::1-phenyl-8-((trans,rac)-2-phenyl-cyclohexyl)-1,3,8-triaza-spiro[4.5]decan-4-one::CHEMBL371267
SMILES O=C1NCN(c2ccccc2)C11CCN(CC1)[C@@H]1CCCC[C@H]1c1ccccc1
InChI Key InChIKey=XMWPUEPUQVYCIC-XZOQPEGZSA-N
Data  4 IC50  4 EC50
  Tab Delimited (TSV)   2D SDfile   Computed 3D by Vconf -m prep SDfile
Find this compound or compounds like it in BindingDB:
Activity Spreadsheet -- Enzyme Inhibition Constant Data from BindingDB
Found 8 hits for monomerid = 50175920
TargetSodium- and chloride-dependent glycine transporter 1(Homo sapiens (Human))
F. Hoffmann-La Roche
Curated by ChEMBL
LigandPNGBDBM50175920(1-phenyl-8-((trans, rac)-2-phenyl-cyclohexyl)-1,3,...)
Affinity DataEC50:  73nM. Assay description: Inhibition of [3H]glycine uptake in cells transfected with human GlyT1 cDNA
In DepthDetails ArticlePubMed
TargetSodium- and chloride-dependent glycine transporter 2(Homo sapiens (Human))
F. Hoffmann-La Roche
Curated by ChEMBL
LigandPNGBDBM50175920(1-phenyl-8-((trans, rac)-2-phenyl-cyclohexyl)-1,3,...)
Affinity DataEC50:  1.00E+4nM. Assay description: Inhibition of [3H]glycine uptake in cells transfected with human GlyT2 cDNA
In DepthDetails ArticlePubMed
TargetSodium- and chloride-dependent glycine transporter 1(Homo sapiens (Human))
F. Hoffmann-La Roche
Curated by ChEMBL
LigandPNGBDBM50175920(1-phenyl-8-((trans, rac)-2-phenyl-cyclohexyl)-1,3,...)
Affinity DataEC50:  73nM. Assay description: Displacement of [3H]glycine from human GlyT1 by radiometric assay
In DepthDetails ArticlePubMed
TargetMu-type opioid receptor(Homo sapiens (Human))
F. Hoffmann-La Roche
Curated by ChEMBL
LigandPNGBDBM50175920(1-phenyl-8-((trans, rac)-2-phenyl-cyclohexyl)-1,3,...)
Affinity DataIC50:  540nM. Assay description: Inhibitory activity at human mu opioid receptor in BHK cells by GTPgammaS binding assay
In DepthDetails ArticlePubMed
TargetMu-type opioid receptor(Homo sapiens (Human))
F. Hoffmann-La Roche
Curated by ChEMBL
LigandPNGBDBM50175920(1-phenyl-8-((trans, rac)-2-phenyl-cyclohexyl)-1,3,...)
Affinity DataIC50:  540nM. Assay description: Displacement of [3H]naloxone from human mu opioid receptor expressed in BHK cells
In DepthDetails ArticlePubMed
TargetNociceptin receptor(Homo sapiens (Human))
F. Hoffmann-La Roche
Curated by ChEMBL
LigandPNGBDBM50175920(1-phenyl-8-((trans, rac)-2-phenyl-cyclohexyl)-1,3,...)
Affinity DataIC50:  300nM. Assay description: Displacement of [3H]NOP from human NOP receptor expressed in HEK293 cells
In DepthDetails ArticlePubMed
TargetNociceptin receptor(Homo sapiens (Human))
F. Hoffmann-La Roche
Curated by ChEMBL
LigandPNGBDBM50175920(1-phenyl-8-((trans, rac)-2-phenyl-cyclohexyl)-1,3,...)
Affinity DataIC50:  310nM. Assay description: Displacement of [3H]NOP from human NOP receptor expressed in HEK293 cells
In DepthDetails ArticlePubMed
TargetSodium- and chloride-dependent glycine transporter 2(Homo sapiens (Human))
F. Hoffmann-La Roche
Curated by ChEMBL
LigandPNGBDBM50175920(1-phenyl-8-((trans, rac)-2-phenyl-cyclohexyl)-1,3,...)
Affinity DataEC50:  1.03E+4nM. Assay description: Displacement of [3H]glycine from human GlyT2 by radiometric assay
In DepthDetails ArticlePubMed