BDBM50176459 CHEMBL3809207
SMILES NS(=O)(=O)c1ccc(Nc2nc(Nc3ccc(F)cc3)cs2)cc1
InChI Key InChIKey=WELOXGYWNUDBGO-UHFFFAOYSA-N
Data  3 KI
  Tab Delimited (TSV)   2D SDfile   Computed 3D by Vconf -m prep SDfile
Find this compound or compounds like it in BindingDB:
Activity Spreadsheet -- Enzyme Inhibition Constant Data from BindingDB
Found 3 hits for monomerid = 50176459
TargetCarbonic anhydrase 2(Homo sapiens (Human))
Cairo University
Curated by ChEMBL
LigandPNGBDBM50176459(CHEMBL3809207)
Affinity DataKi:  0.580nM. Assay description: Inhibition of human recombinant CA2 preincubated for 15 mins prior to testing by stopped flow CO2 hydrase assay
In DepthDetails ArticlePubMed
TargetCarbonic anhydrase 1(Homo sapiens (Human))
Cairo University
Curated by ChEMBL
LigandPNGBDBM50176459(CHEMBL3809207)
Affinity DataKi:  3.20nM. Assay description: Inhibition of human recombinant CA1 preincubated for 15 mins prior to testing by stopped flow CO2 hydrase assay
In DepthDetails ArticlePubMed
TargetCarbonic anhydrase 9(Homo sapiens (Human))
Cairo University
Curated by ChEMBL
LigandPNGBDBM50176459(CHEMBL3809207)
Affinity DataKi:  5.60nM. Assay description: Inhibition of human recombinant CA9 preincubated for 15 mins prior to testing by stopped flow CO2 hydrase assay
In DepthDetails ArticlePubMed