BDBM50176500 (3S)-4-oxo-3-(6-(4-(quinoxalin-2-ylamino)benzamido)-2-(thiophen-2-yl)hexanamido)butanoic acid::CHEMBL202060
SMILES OC(=O)C[C@H](NC(=O)C(CCCCNC(=O)c1ccc(Nc2cnc3ccccc3n2)cc1)c1cccs1)C=O
InChI Key InChIKey=UDXKQFUGOHHYGE-HMTLIYDFSA-N
Data  1 KI
  Tab Delimited (TSV)   2D SDfile   Computed 3D by Vconf -m prep SDfile
Find this compound or compounds like it in BindingDB:
Activity Spreadsheet -- Enzyme Inhibition Constant Data from BindingDB
Found 1 hit for monomerid = 50176500
TargetCaspase-1(Homo sapiens (Human))
Sunesis Pharmaceuticals
Curated by ChEMBL
LigandPNGBDBM50176500((3S)-4-oxo-3-(6-(4-(quinoxalin-2-ylamino)benzamido...)
Affinity DataKi:  7nM. Assay description: Inhibitory activity against human Caspase 1
In DepthDetails ArticlePubMed