BDBM50176512 (S)-4-oxo-3-(2-((4-(quinoxalin-2-ylamino)benzamido)methyl)thiophene-4-carboxamido)butanoic acid::CHEMBL202618
SMILES OC(=O)C[C@H](NC(=O)c1csc(CNC(=O)c2ccc(Nc3cnc4ccccc4n3)cc2)c1)C=O
InChI Key InChIKey=ALNJVUIIGVWCNW-SFHVURJKSA-N
Data  1 KI
  Tab Delimited (TSV)   2D SDfile   Computed 3D by Vconf -m prep SDfile
Find this compound or compounds like it in BindingDB:
Activity Spreadsheet -- Enzyme Inhibition Constant Data from BindingDB
Found 1 hit for monomerid = 50176512
TargetCaspase-1(Homo sapiens (Human))
Sunesis Pharmaceuticals
Curated by ChEMBL
LigandPNGBDBM50176512((S)-4-oxo-3-(2-((4-(quinoxalin-2-ylamino)benzamido...)
Affinity DataKi:  120nM. Assay description: Inhibitory activity against human Caspase 1
In DepthDetails ArticlePubMed