BDBM50176513 (3S)-4-oxo-3-(6-(4-(pyrazin-2-ylamino)benzamido)-2-(thiophen-2-yl)hexanamido)butanoic acid::CHEMBL382814
SMILES OC(=O)C[C@H](NC(=O)C(CCCCNC(=O)c1ccc(Nc2cnccn2)cc1)c1cccs1)C=O
InChI Key InChIKey=SIAQZPYROUYFJA-XJDOXCRVSA-N
Data  1 KI
  Tab Delimited (TSV)   2D SDfile   Computed 3D by Vconf -m prep SDfile
Find this compound or compounds like it in BindingDB:
Activity Spreadsheet -- Enzyme Inhibition Constant Data from BindingDB
Found 1 hit for monomerid = 50176513
TargetCaspase-1(Homo sapiens (Human))
Sunesis Pharmaceuticals
Curated by ChEMBL
LigandPNGBDBM50176513((3S)-4-oxo-3-(6-(4-(pyrazin-2-ylamino)benzamido)-2...)
Affinity DataKi:  100nM. Assay description: Inhibitory activity against human Caspase 1
In DepthDetails ArticlePubMed