BDBM50176813 CHEMBL3809159
SMILES CC1=NN(C(=O)\C1=C/c1ccc(o1)-c1ccccc1)c1cccc(c1)C(O)=O
InChI Key InChIKey=UQWUDRZSFFOCJP-UYRXBGFRSA-N
Data  1 IC50
  Tab Delimited (TSV)   2D SDfile   Computed 3D by Vconf -m prep SDfile
Find this compound or compounds like it in BindingDB:
Activity Spreadsheet -- Enzyme Inhibition Constant Data from BindingDB
Found 1 hit for monomerid = 50176813
TargetReplicase polyprotein 1ab(Human SARS coronavirus (SARS-CoV) (Severe acute re...)
Academia Sinica
Curated by ChEMBL
LigandPNGBDBM50176813(CHEMBL3809159)
Affinity DataIC50: >5.00E+4nM. Assay description: Inhibition of SARS coronavirus recombinant 3CL-PRO expressed in Escherichia coli JM109 cells using Dabcyl-KTSAVLQSGFRKME-Edans as fluorogenic substra...
In DepthDetails ArticlePubMed