BDBM50176837 CHEMBL224125::propyl 1-(2-chloro-2-phenylethyl)-4-morpholino-1H-pyrazolo[3,4-b]pyridine-5-carboxylate
SMILES CCCOC(=O)c1cnc2n(CC(Cl)c3ccccc3)ncc2c1N1CCOCC1
InChI Key InChIKey=OYYJEIHUJRNSJW-UHFFFAOYSA-N
Data  1 KI
  Tab Delimited (TSV)   2D SDfile   Computed 3D by Vconf -m prep SDfile
Find this compound or compounds like it in BindingDB:
Activity Spreadsheet -- Enzyme Inhibition Constant Data from BindingDB
Found 1 hit for monomerid = 50176837
TargetAdenosine receptor A1(BOVINE)
Università
Curated by ChEMBL
LigandPNGBDBM50176837(CHEMBL224125 | propyl 1-(2-chloro-2-phenylethyl)-4...)
Affinity DataKi:  2.15E+3nM. Assay description: Displacement of [3H]DPCPX from adenosine A1 receptor in bovine cerebral cortical membranes
In DepthDetails ArticlePubMed