BDBM50176845 CHEMBL224619::isopropyl 4-(3-chlorophenethylamino)-1-(2-chloro-2-phenylethyl)-1H-pyrazolo[3,4-b]pyridine-5-carboxylate
SMILES CC(C)OC(=O)c1cnc2n(CC(Cl)c3ccccc3)ncc2c1NCCc1cccc(Cl)c1
InChI Key InChIKey=MCFKQWMZMTUIAE-UHFFFAOYSA-N
Data  1 KI
  Tab Delimited (TSV)   2D SDfile   Computed 3D by Vconf -m prep SDfile
Find this compound or compounds like it in BindingDB:
Activity Spreadsheet -- Enzyme Inhibition Constant Data from BindingDB
Found 1 hit for monomerid = 50176845
TargetAdenosine receptor A1(BOVINE)
Università
Curated by ChEMBL
LigandPNGBDBM50176845(CHEMBL224619 | isopropyl 4-(3-chlorophenethylamino...)
Affinity DataKi:  100nM. Assay description: Displacement of [3H]DPCPX from adenosine A1 receptor in bovine cerebral cortical membranes
In DepthDetails ArticlePubMed