BDBM50176847 CHEMBL224313::ethyl 4-(2-chlorophenethylamino)-1-(2-chloro-2-phenylethyl)-1H-pyrazolo[3,4-b]pyridine-5-carboxylate
SMILES CCOC(=O)c1cnc2n(CC(Cl)c3ccccc3)ncc2c1NCCc1ccccc1Cl
InChI Key InChIKey=GOWNIRTVZHTGTN-UHFFFAOYSA-N
Data  1 KI
  Tab Delimited (TSV)   2D SDfile   Computed 3D by Vconf -m prep SDfile
Find this compound or compounds like it in BindingDB:
Activity Spreadsheet -- Enzyme Inhibition Constant Data from BindingDB
Found 1 hit for monomerid = 50176847
TargetAdenosine receptor A1(BOVINE)
Università
Curated by ChEMBL
LigandPNGBDBM50176847(CHEMBL224313 | ethyl 4-(2-chlorophenethylamino)-1-...)
Affinity DataKi:  76nM. Assay description: Displacement of [3H]DPCPX from adenosine A1 receptor in bovine cerebral cortical membranes
In DepthDetails ArticlePubMed