BDBM50176852 1-(2-chloro-2-phenyl-ethyl)-4-(2-p-tolyl-ethylamino)-1H-pyrazolo[3,4-b]pyridine-5-carboxylic acid cyclopropylmethyl ester::CHEMBL375690
SMILES Cc1ccc(CCNc2c(cnc3n(CC(Cl)c4ccccc4)ncc23)C(=O)OCC2CC2)cc1
InChI Key InChIKey=IWQXSZVGOYWAGJ-UHFFFAOYSA-N
Data  1 KI
  Tab Delimited (TSV)   2D SDfile   Computed 3D by Vconf -m prep SDfile
Find this compound or compounds like it in BindingDB:
Activity Spreadsheet -- Enzyme Inhibition Constant Data from BindingDB
Found 1 hit for monomerid = 50176852
TargetAdenosine receptor A1(BOVINE)
Università
Curated by ChEMBL
LigandPNGBDBM50176852(1-(2-chloro-2-phenyl-ethyl)-4-(2-p-tolyl-ethylamin...)
Affinity DataKi:  63nM. Assay description: Displacement of [3H]DPCPX from adenosine A1 receptor in bovine cerebral cortical membranes
In DepthDetails ArticlePubMed