BDBM50176856 CHEMBL3810325
SMILES OC(=O)c1ccccc1-c1ccc(\C=C2/C(=O)N(N=C2c2ccccc2)c2ccc(F)cc2)o1
InChI Key InChIKey=XKQCHIXXQNMHLJ-KQWNVCNZSA-N
Data  1 IC50
  Tab Delimited (TSV)   2D SDfile   Computed 3D by Vconf -m prep SDfile
Find this compound or compounds like it in BindingDB:
Activity Spreadsheet -- Enzyme Inhibition Constant Data from BindingDB
Found 1 hit for monomerid = 50176856
TargetReplicase polyprotein 1ab(Human SARS coronavirus (SARS-CoV) (Severe acute re...)
Academia Sinica
Curated by ChEMBL
LigandPNGBDBM50176856(CHEMBL3810325)
Affinity DataIC50:  3.75E+4nM. Assay description: Inhibition of SARS coronavirus recombinant 3CL-PRO expressed in Escherichia coli JM109 cells using Dabcyl-KTSAVLQSGFRKME-Edans as fluorogenic substra...
In DepthDetails ArticlePubMed