BDBM50177122 CHEMBL3814362
SMILES CCCCCCCC\C=C/CCCCCCCC(=O)OCC1OCCCC1OP(O)(=O)OCC(N)C(O)=O
InChI Key InChIKey=VWKCFDZBVNFTLU-AUMIFUJISA-N
Data  5 EC50
  Tab Delimited (TSV)   2D SDfile   Computed 3D by Vconf -m prep SDfile
Find this compound or compounds like it in BindingDB:
Activity Spreadsheet -- Enzyme Inhibition Constant Data from BindingDB
Found 5 hits for monomerid = 50177122
TargetPutative P2Y purinoceptor 10(Mus musculus)
The University Of Tokyo
Curated by ChEMBL
LigandPNGBDBM50177122(CHEMBL3814362)
Affinity DataEC50:  457nM. Assay description: Agonist activity at mouse P2Y10 receptor expressed in HEK293A cells after 1.5 hrs by alkaline phosphatase tagged-TGFalpha shedding assay
In DepthDetails ArticlePubMed
TargetPutative P2Y purinoceptor 10(Mus musculus)
The University Of Tokyo
Curated by ChEMBL
LigandPNGBDBM50177122(CHEMBL3814362)
Affinity DataEC50:  450nM. Assay description: Agonist activity at mouse P2Y10 receptor expressed in HEK293A cells after 1.5 hrs by alkaline phosphatase tagged-TGFalpha shedding assay
In DepthDetails ArticlePubMed
TargetProbable G-protein coupled receptor 34(Mus musculus)
The University Of Tokyo
Curated by ChEMBL
LigandPNGBDBM50177122(CHEMBL3814362)
Affinity DataEC50:  100nM. Assay description: Agonist activity at mouse GPR34 expressed in HEK293A cells cotransfected with chimeric Galphaq/il after 1.5 hrs by alkaline phosphatase tagged-TGFalp...
In DepthDetails ArticlePubMed
TargetProbable G-protein coupled receptor 34(Mus musculus)
The University Of Tokyo
Curated by ChEMBL
LigandPNGBDBM50177122(CHEMBL3814362)
Affinity DataEC50:  210nM. Assay description: Agonist activity at mouse GPR34 expressed in HEK293A cells cotransfected with chimeric Galphaq/il after 1.5 hrs by alkaline phosphatase tagged-TGFalp...
In DepthDetails ArticlePubMed
TargetProbable G-protein coupled receptor 34(Mus musculus)
The University Of Tokyo
Curated by ChEMBL
LigandPNGBDBM50177122(CHEMBL3814362)
Affinity DataEC50:  209nM. Assay description: Agonist activity at mouse GPR34 expressed in HEK293A cells cotransfected with chimeric Galphaq/il after 1.5 hrs by alkaline phosphatase tagged-TGFalp...
In DepthDetails ArticlePubMed