BDBM50177131 CHEMBL3815141
SMILES N[C@@H](COP(O)(=O)OC[C@H]1OCCC[C@H]1OC(=O)CCc1ccccc1OCc1cccc(Oc2ccc(Cl)cc2)c1)C(O)=O
InChI Key InChIKey=LIMYTUSBKLMPQR-WIIGKZCBSA-N
Data  3 EC50
  Tab Delimited (TSV)   2D SDfile   Computed 3D by Vconf -m prep SDfile
Find this compound or compounds like it in BindingDB:
Activity Spreadsheet -- Enzyme Inhibition Constant Data from BindingDB
Found 3 hits for monomerid = 50177131
TargetProbable G-protein coupled receptor 34(Mus musculus)
The University Of Tokyo
Curated by ChEMBL
LigandPNGBDBM50177131(CHEMBL3815141)
Affinity DataEC50:  120nM. Assay description: Agonist activity at mouse GPR34 expressed in HEK293A cells cotransfected with chimeric Galphaq/il after 1.5 hrs by alkaline phosphatase tagged-TGFalp...
In DepthDetails ArticlePubMed
TargetPutative P2Y purinoceptor 10(Mus musculus)
The University Of Tokyo
Curated by ChEMBL
LigandPNGBDBM50177131(CHEMBL3815141)
Affinity DataEC50: >1.00E+3nM. Assay description: Agonist activity at mouse P2Y10 receptor expressed in HEK293A cells after 1.5 hrs by alkaline phosphatase tagged-TGFalpha shedding assay
In DepthDetails ArticlePubMed
TargetProbable G-protein coupled receptor 34(Mus musculus)
The University Of Tokyo
Curated by ChEMBL
LigandPNGBDBM50177131(CHEMBL3815141)
Affinity DataEC50:  117nM. Assay description: Agonist activity at mouse GPR34 expressed in HEK293A cells cotransfected with chimeric Galphaq/il after 1.5 hrs by alkaline phosphatase tagged-TGFalp...
In DepthDetails ArticlePubMed