BDBM50177305 2-(2,4-dichlorophenylamino)-N-(2-((2-(dimethylamino)ethyl)(methyl)amino)-4-methylquinolin-6-yl)acetamide::CHEMBL203804
SMILES CN(C)CCN(C)c1cc(C)c2cc(NC(=O)CNc3ccc(Cl)cc3Cl)ccc2n1
InChI Key InChIKey=ABHLVXSUCSLTLA-UHFFFAOYSA-N
Data  1 IC50
  Tab Delimited (TSV)   2D SDfile   Computed 3D by Vconf -m prep SDfile
Find this compound or compounds like it in BindingDB:
Activity Spreadsheet -- Enzyme Inhibition Constant Data from BindingDB
Found 1 hit for monomerid = 50177305
TargetMelanin-concentrating hormone receptor 1(Homo sapiens (Human))
7Tm Pharma
Curated by ChEMBL
LigandPNGBDBM50177305(2-(2,4-dichlorophenylamino)-N-(2-((2-(dimethylamin...)
Affinity DataIC50:  125nM. Assay description: Inhibition of human MCH1 receptor by SPA assay
In DepthDetails ArticlePubMed