BDBM50177315 2-[4-(2-Methyl-quinolin-4-ylmethoxy)-phenyl]-1,1-dioxo-1lambda*6*-[1,2]thiazinane-3-carboxylic acid hydroxyamide::2-[4-(2-methyl-quinolin-4-ylmethoxy)-phenyl]-1,1-dioxo-[1,2]thiazinane-3-carboxylic acid hydroxyamide::CHEMBL203160
SMILES Cc1cc(COc2ccc(cc2)N2C(CCCS2(=O)=O)C(=O)NO)c2ccccc2n1
InChI Key InChIKey=XVLVIDNHSWHJBN-UHFFFAOYSA-N
Data  4 KI  2 IC50
  Tab Delimited (TSV)   2D SDfile   Computed 3D by Vconf -m prep SDfile
Find this compound or compounds like it in BindingDB:
Activity Spreadsheet -- Enzyme Inhibition Constant Data from BindingDB
Found 6 hits for monomerid = 50177315
TargetMatrix metalloproteinase-9(Homo sapiens (Human))
Bristol-Myers Squibb Pharmaceutical Research Institute
Curated by ChEMBL
LigandPNGBDBM50177315(2-[4-(2-Methyl-quinolin-4-ylmethoxy)-phenyl]-1,1-d...)
Affinity DataKi: >2.13E+3nM. Assay description: Binding affinity to MMP9
In DepthDetails ArticlePubMed
Target72 kDa type IV collagenase(Homo sapiens (Human))
Bristol-Myers Squibb Pharmaceutical Research Institute
Curated by ChEMBL
LigandPNGBDBM50177315(2-[4-(2-Methyl-quinolin-4-ylmethoxy)-phenyl]-1,1-d...)
Affinity DataKi: >3.33E+3nM. Assay description: Binding affinity to MMP2
In DepthDetails ArticlePubMed
TargetInterstitial collagenase(Homo sapiens (Human))
Bristol-Myers Squibb Pharmaceutical Research Institute
Curated by ChEMBL
LigandPNGBDBM50177315(2-[4-(2-Methyl-quinolin-4-ylmethoxy)-phenyl]-1,1-d...)
Affinity DataKi: >4.95E+3nM. Assay description: Binding affinity to MMP1
In DepthDetails ArticlePubMed
TargetCollagenase 3(Homo sapiens (Human))
Bristol-Myers Squibb Pharmaceutical Research Institute
Curated by ChEMBL
LigandPNGBDBM50177315(2-[4-(2-Methyl-quinolin-4-ylmethoxy)-phenyl]-1,1-d...)
Affinity DataKi: >5.03E+3nM. Assay description: Binding affinity to MMP13
In DepthDetails ArticlePubMed
TargetDisintegrin and metalloproteinase domain-containing protein 17(Homo sapiens (Human))
Bristol-Myers Squibb Pharmaceutical Research Institute
Curated by ChEMBL
LigandPNGBDBM50177315(2-[4-(2-Methyl-quinolin-4-ylmethoxy)-phenyl]-1,1-d...)
Affinity DataIC50:  3.70nM. Assay description: Inhibitory activity against TACE
In DepthDetails ArticlePubMed
TargetDisintegrin and metalloproteinase domain-containing protein 17(Homo sapiens (Human))
Bristol-Myers Squibb Pharmaceutical Research Institute
Curated by ChEMBL
LigandPNGBDBM50177315(2-[4-(2-Methyl-quinolin-4-ylmethoxy)-phenyl]-1,1-d...)
Affinity DataIC50:  3.70nM. Assay description: Inhibition of TACE
In DepthDetails ArticlePubMed