BDBM50177365 CHEMBL264520::N-(trans-4-(2-(8-methoxy-1,2,4,4a,5,6-hexahydropyrazino[1,2-a]quinolin-3-yl)ethyl)cyclohexyl)quinoline-8-carboxamide
SMILES COc1ccc2N3CCN(CC[C@H]4CC[C@@H](CC4)NC(=O)c4cccc5cccnc45)CC3CCc2c1
InChI Key InChIKey=PIHZDDZVIOMFHO-HDVKRFLQSA-N
Data  1 KI
  Tab Delimited (TSV)   2D SDfile   Computed 3D by Vconf -m prep SDfile
Find this compound or compounds like it in BindingDB:
Activity Spreadsheet -- Enzyme Inhibition Constant Data from BindingDB
Found 1 hit for monomerid = 50177365
TargetD(3) dopamine receptor(Rattus norvegicus (Rat))
University Of Michigan
Curated by ChEMBL
LigandPNGBDBM50177365(CHEMBL264520 | N-(trans-4-(2-(8-methoxy-1,2,4,4a,5...)
Affinity DataKi:  87nM. Assay description: Displacement of [3H]PD 128907 from rat ventral striatal membrane dopamine D3-like receptor
In DepthDetails ArticlePubMed