BDBM50177414 CHEMBL540368::N-((6-amino-2-methylpyridin-3-yl)methyl)-2-(2-hydroxy-6-methyl-3-(phenylsulfonylmethylamino)phenyl)acetamide hydrochloride
SMILES Cc1ccc(NCS(=O)(=O)c2ccccc2)c(O)c1CC(=O)NCc1ccc(N)nc1C
InChI Key InChIKey=PSLRFTOBIBYZHZ-UHFFFAOYSA-N
Data  1 IC50
  Tab Delimited (TSV)   2D SDfile   Computed 3D by Vconf -m prep SDfile
Find this compound or compounds like it in BindingDB:
Activity Spreadsheet -- Enzyme Inhibition Constant Data from BindingDB
Found 1 hit for monomerid = 50177414
TargetProthrombin(Homo sapiens (Human))
Universit£
Curated by ChEMBL
LigandPNGBDBM50177414(CHEMBL540368 | N-((6-amino-2-methylpyridin-3-yl)me...)
Affinity DataIC50:  570nM. Assay description: Inhibitory activity against thrombin
In DepthDetails ArticlePubMed