BDBM50177416 CHEMBL535831::N-(4-carbamimidoyl-benzyl)-2-[2-hydroxy-6-methyl-3-(2-oxo-2-phenyl-ethylamino)-phenyl]-acetamide; hydrochloride
SMILES Cc1ccc(NCC(=O)c2ccccc2)c(O)c1CC(=O)NCc1ccc(cc1)C(N)=N
InChI Key InChIKey=CLSRIFHZLIMHCQ-UHFFFAOYSA-N
Data  1 IC50
  Tab Delimited (TSV)   2D SDfile   Computed 3D by Vconf -m prep SDfile
Find this compound or compounds like it in BindingDB:
Activity Spreadsheet -- Enzyme Inhibition Constant Data from BindingDB
Found 1 hit for monomerid = 50177416
TargetProthrombin(Homo sapiens (Human))
Universit£
Curated by ChEMBL
LigandPNGBDBM50177416(CHEMBL535831 | N-(4-carbamimidoyl-benzyl)-2-[2-hyd...)
Affinity DataIC50:  4.70E+3nM. Assay description: Inhibitory activity against thrombin
In DepthDetails ArticlePubMed