BDBM50177426 CHEMBL556576::N-((3-(2-(4-carbamimidoylbenzylamino)-2-oxoethyl)-2-hydroxy-4-methylphenylamino)methyl)benzamide hydrochloride
SMILES Cc1ccc(NCNC(=O)c2ccccc2)c(O)c1CC(=O)NCc1ccc(cc1)C(N)=N
InChI Key InChIKey=GSOJLOAYKBVJEP-UHFFFAOYSA-N
Data  1 IC50
  Tab Delimited (TSV)   2D SDfile   Computed 3D by Vconf -m prep SDfile
Find this compound or compounds like it in BindingDB:
Activity Spreadsheet -- Enzyme Inhibition Constant Data from BindingDB
Found 1 hit for monomerid = 50177426
TargetProthrombin(Homo sapiens (Human))
Universit£
Curated by ChEMBL
LigandPNGBDBM50177426(CHEMBL556576 | N-((3-(2-(4-carbamimidoylbenzylamin...)
Affinity DataIC50:  2.40E+3nM. Assay description: Inhibitory activity against thrombin
In DepthDetails ArticlePubMed