BDBM50177435 2-(3-((3-chlorophenylsulfonyl)methylamino)-2-hydroxy-6-methylphenyl)-N-((3-fluoro-4-methylpyridin-2-yl)methyl)acetamide::CHEMBL381141
SMILES Cc1ccnc(CNC(=O)Cc2c(C)ccc(NCS(=O)(=O)c3cccc(Cl)c3)c2O)c1F
InChI Key InChIKey=TXJBVOWBNXLNJY-UHFFFAOYSA-N
Data  1 IC50
  Tab Delimited (TSV)   2D SDfile   Computed 3D by Vconf -m prep SDfile
Find this compound or compounds like it in BindingDB:
Activity Spreadsheet -- Enzyme Inhibition Constant Data from BindingDB
Found 1 hit for monomerid = 50177435
TargetProthrombin(Homo sapiens (Human))
Universit£
Curated by ChEMBL
LigandPNGBDBM50177435(2-(3-((3-chlorophenylsulfonyl)methylamino)-2-hydro...)
Affinity DataIC50:  1.50E+4nM. Assay description: Inhibitory activity against thrombin
In DepthDetails ArticlePubMed