BDBM50178155 4-ethoxy-N-(4-methylphenyl)-N-{3-oxo-3-[2-(2-oxo-1,2-dihydro-3H-indol-3-ylidene)hydrazino]propyl}benzenesulfonamide::CHEMBL200498
SMILES CCOc1ccc(cc1)S(=O)(=O)N(CCC(=O)N=Nc1c(O)[nH]c2ccccc12)c1ccc(C)cc1
InChI Key InChIKey=PJOYUFYVLCJASN-UHFFFAOYSA-N
Data  2 KI
  Tab Delimited (TSV)   2D SDfile   Computed 3D by Vconf -m prep SDfile
Find this compound or compounds like it in BindingDB:
Activity Spreadsheet -- Enzyme Inhibition Constant Data from BindingDB
Found 2 hits for monomerid = 50178155
TargetOxytocin receptor(Homo sapiens (Human))
Serono Pharmaceutical Research Institute
Curated by ChEMBL
LigandPNGBDBM50178155(4-ethoxy-N-(4-methylphenyl)-N-{3-oxo-3-[2-(2-oxo-1...)
Affinity DataKi: >1.00E+4nM. Assay description: Displacement of [125I]OVTA antagonist from human oxytocin receptor expressed in HEK293-EBNA cells
In DepthDetails ArticlePubMed
TargetVasopressin V1a receptor(Homo sapiens (Human))
Serono Pharmaceutical Research Institute
Curated by ChEMBL
LigandPNGBDBM50178155(4-ethoxy-N-(4-methylphenyl)-N-{3-oxo-3-[2-(2-oxo-1...)
Affinity DataKi: >1.00E+4nM. Assay description: Displacement of [125I]LVA antagonist from human vasopressin 1a receptor expressed in HEK293-EBNA cells
In DepthDetails ArticlePubMed