BDBM50178179 CHEMBL444879::N-(3-chloro-2-methylphenyl)-2-(N-(4-ethoxyphenyl)phenylsulfonamido)acetamide
SMILES CCOc1ccc(cc1)N(CC(=O)Nc1cccc(Cl)c1C)S(=O)(=O)c1ccccc1
InChI Key InChIKey=PHXLJXNTXCAAJH-UHFFFAOYSA-N
Data  2 KI
  Tab Delimited (TSV)   2D SDfile   Computed 3D by Vconf -m prep SDfile
Find this compound or compounds like it in BindingDB:
Activity Spreadsheet -- Enzyme Inhibition Constant Data from BindingDB
Found 2 hits for monomerid = 50178179
TargetOxytocin receptor(Homo sapiens (Human))
Serono Pharmaceutical Research Institute
Curated by ChEMBL
LigandPNGBDBM50178179(CHEMBL444879 | N-(3-chloro-2-methylphenyl)-2-(N-(4...)
Affinity DataKi: >1.00E+4nM. Assay description: Displacement of [125I]OVTA antagonist from human oxytocin receptor expressed in HEK293-EBNA cells
In DepthDetails ArticlePubMed
TargetVasopressin V1a receptor(Homo sapiens (Human))
Serono Pharmaceutical Research Institute
Curated by ChEMBL
LigandPNGBDBM50178179(CHEMBL444879 | N-(3-chloro-2-methylphenyl)-2-(N-(4...)
Affinity DataKi: >1.00E+4nM. Assay description: Displacement of [125I]LVA antagonist from human vasopressin 1a receptor expressed in HEK293-EBNA cells
In DepthDetails ArticlePubMed