BDBM50178196 CHEMBL381448::N-{2-{(E)-[2-(2-{[(4-ethoxyphenyl)sulfonyl]-4-methylanilino}acetyl)hydrazono]methyl}phenyl)acetamide
SMILES CCOc1ccc(cc1)S(=O)(=O)N(CC(=O)NN=Cc1ccccc1NC(C)=O)c1ccc(C)cc1
InChI Key InChIKey=FVIYLUNZAQJQQY-UHFFFAOYSA-N
Data  2 KI
  Tab Delimited (TSV)   2D SDfile   Computed 3D by Vconf -m prep SDfile
Find this compound or compounds like it in BindingDB:
Activity Spreadsheet -- Enzyme Inhibition Constant Data from BindingDB
Found 2 hits for monomerid = 50178196
TargetVasopressin V1a receptor(Homo sapiens (Human))
Serono Pharmaceutical Research Institute
Curated by ChEMBL
LigandPNGBDBM50178196(CHEMBL381448 | N-{2-{(E)-[2-(2-{[(4-ethoxyphenyl)s...)
Affinity DataKi: >1.00E+4nM. Assay description: Displacement of [125I]LVA antagonist from human vasopressin 1a receptor expressed in HEK293-EBNA cells
In DepthDetails ArticlePubMed
TargetOxytocin receptor(Homo sapiens (Human))
Serono Pharmaceutical Research Institute
Curated by ChEMBL
LigandPNGBDBM50178196(CHEMBL381448 | N-{2-{(E)-[2-(2-{[(4-ethoxyphenyl)s...)
Affinity DataKi: >1.00E+4nM. Assay description: Displacement of [125I]OVTA antagonist from human oxytocin receptor expressed in HEK293-EBNA cells
In DepthDetails ArticlePubMed