BDBM50178295 CHEMBL3814512
SMILES CSc1nn(C(N)=O)c(N)c1C(N)=O
InChI Key InChIKey=TUVCBRIDRHWVLF-UHFFFAOYSA-N
Data  1 IC50
PDB links: 1 PDB ID matches this monomer.
  Tab Delimited (TSV)   2D SDfile   Computed 3D by Vconf -m prep SDfile
Find this compound or compounds like it in BindingDB:
Activity Spreadsheet -- Enzyme Inhibition Constant Data from BindingDB
Found 1 hit for monomerid = 50178295
Target3-phosphoinositide-dependent protein kinase 1(Homo sapiens (Human))
Merck
Curated by ChEMBL
LigandPNGBDBM50178295(CHEMBL3814512)
Affinity DataIC50:  1.70E+4nM. Assay description: Inhibition of human His6-tagged PDK1 using biotinylated PDKtide as substrate after 60 mins by topcount method