BDBM50178427 (1R,2S)-1,2-diphenylethane-1,2-diamine::CHEMBL206743
SMILES N[C@@H]([C@@H](N)c1ccccc1)c1ccccc1
InChI Key InChIKey=PONXTPCRRASWKW-OKILXGFUSA-N
Data  1 IC50
PDB links: 1 PDB ID matches this monomer.
  Tab Delimited (TSV)   2D SDfile   Computed 3D by Vconf -m prep SDfile
Find this compound or compounds like it in BindingDB:
Activity Spreadsheet -- Enzyme Inhibition Constant Data from BindingDB
Found 1 hit for monomerid = 50178427
TargetDipeptidyl peptidase 4(Homo sapiens (Human))
Santhera Pharmaceuticals
Curated by ChEMBL
LigandPNGBDBM50178427((1R,2S)-1,2-diphenylethane-1,2-diamine | CHEMBL206...)
Affinity DataIC50:  7.50E+4nM. Assay description: Inhibition of DPP4
In DepthDetails ArticlePubMed