BDBM50178432 (1R,2R)-1,2-diphenylethane-1,2-diamine::(R,R)-(+)-1,2-diphenylethylenediamine::CHEMBL381340
SMILES N[C@@H]([C@H](N)c1ccccc1)c1ccccc1
InChI Key InChIKey=PONXTPCRRASWKW-ZIAGYGMSSA-N
Data  1 IC50
PDB links: 1 PDB ID matches this monomer.
  Tab Delimited (TSV)   2D SDfile   Computed 3D by Vconf -m prep SDfile
Find this compound or compounds like it in BindingDB:
Activity Spreadsheet -- Enzyme Inhibition Constant Data from BindingDB
Found 1 hit for monomerid = 50178432
TargetDipeptidyl peptidase 4(Homo sapiens (Human))
Santhera Pharmaceuticals
Curated by ChEMBL
LigandPNGBDBM50178432((1R,2R)-1,2-diphenylethane-1,2-diamine | (R,R)-(+)...)
Affinity DataIC50:  4.50E+4nM. Assay description: Inhibition of DPP4
In DepthDetails ArticlePubMed