BDBM50178539 CHEMBL202938::N-(2-fluoroethyl)-4-(5-(4-methoxyphenyl)thiophen-2-yl)benzenamine
SMILES COc1ccc(cc1)-c1ccc(s1)-c1ccc(NCCF)cc1
InChI Key InChIKey=AXPCASKKVQNPKC-UHFFFAOYSA-N
Data  1 KI
  Tab Delimited (TSV)   2D SDfile   Computed 3D by Vconf -m prep SDfile
Find this compound or compounds like it in BindingDB:
Activity Spreadsheet -- Enzyme Inhibition Constant Data from BindingDB
Found 1 hit for monomerid = 50178539
TargetAmyloid-beta precursor protein(Homo sapiens (Human))
University Of Pennsylvania
Curated by ChEMBL
LigandPNGBDBM50178539(CHEMBL202938 | N-(2-fluoroethyl)-4-(5-(4-methoxyph...)
Affinity DataKi:  22nM. Assay description: Displacement of [125I]IMPY from beta amyloid plaque in brain homogenates
In DepthDetails ArticlePubMed